{"text_format":"1","workbook":"xlsx","n_sheets":8,"sheets":["EC Instructions","EC Data","EC Format","1. Instructions","2. Start","3. Detailed table ","4. Consolid table (participant)","5. Consolid table (project)"],"not_rendered":{"charts":0,"images":6,"macros":1,"external_links":0,"defined_names":413,"comments":0,"pivot_tables":0},"unopened":[],"bounds":{"document_bytes":16777216,"sheet_cells":100000,"rows_first":2000,"rows_last":500,"rows_between":2000,"halvings":0,"cell_chars":16384,"cell_head_chars":4096},"cells_cut":0,"cells_raw":0,"read":"whole","date_system":"1900"}

{"sheet":"EC Instructions","index":0,"n_rows":22,"n_cols":1,"rows_kept":22,"cut":false,"hidden":false,"merged":[]}
["EC INSTRUCTIONS (DETAILED BUDGET TABLE AG — PROPOSAL/GRANT PREPARATION) "]
[]
[]
["General"]
["The file is composed of 3 password-protected sheets for EU staff (EC Instructions, EC Data and EC Format) and 5 sheets for the Consortium (Instructions, Start, Detailed table and Consolidated table (participants) and Consolidated table (project). "]
["The EC sheets (EC Data) must be set-up only once for your programme/MGAs (works for all except operating grants - see separate template) as part of the Programme template set-up exercise. \n\nThe Consortium sheets (Start, Detailed table and Consolidated tables) must be filled out and submitted as part of the Proposal (and/or later during GAP):\n- scanned and attached as PDF to the proposal Part B in SEP (for sheets 3 and 4: one per beneficiary/linked third party)\n- uploaded as Excel file in SyGMa (as attachment to the GA Annex 1).\nIf you need the Excel file for the evaluation, ask the coordinator to send them to you by normal e-mail (outside the system)."]
[]
["Getting started"]
["To use the file, the Excel Macro security settings must be enabled on your computer. This is managed and checked when opening the file, but contact your IT team if you encounter problems."]
["Download the file: Before downloading close all other excel files (open excel files may hamper the macros). Download the file from the ToolKit using EDIT WORKBOOK - EDIT IN EXCEL - SAVE AS to save a copy on your desktop. Then close the document and re-open it.  "]
["Unblock the file:  Before starting (and after each time you save), you have to unblock the file by clicking the Unprotect All Sheets button on EC Data sheet (or alternatively by pressing Ctrl Q + Password: Detailed budget table). If it doesn't work, try several times.\n\n"]
[]
["EC-Data sheet"]
["Make your choices in the EC Data sheet. \nWhen finished, click on the Save & Update Detailed Budget Table button."]
[]
{"$rows_left_out":8}
{"sheet":"EC Data","index":1,"n_rows":172,"n_cols":8,"rows_kept":172,"cut":false,"hidden":false,"merged":[[83,2,83,3],[84,2,84,3],[78,4,78,5],[79,4,79,5],[80,4,80,5],[81,4,81,5],[82,4,82,5],[90,2,90,3],[91,2,91,3],[83,4,83,5],[84,4,84,5],[90,4,90,5],[91,4,91,5],[85,2,85,3],[85,4,85,5],[86,2,86,3],[86,4,86,5],[87,2,87,3],[87,4,87,5],[88,2,88,3],[88,4,88,5],[89,2,89,3],[89,4,89,5],[62,0,62,1],[115,2,115,4],[115,5,133,7],[117,0,117,4],[72,0,72,7],[67,0,67,1],[94,0,94,7],[68,0,68,1],[69,0,69,1],[93,0,93,7],[77,0,77,1],[78,2,78,3],[79,2,79,3],[80,2,80,3],[81,2,81,3],[82,2,82,3],[61,4,61,5],[137,0,138,0],[137,1,138,1],[137,2,141,7],[135,0,135,7],[63,0,63,1],[65,0,65,1],[63,4,63,5],[64,4,64,5],[62,4,62,5],[70,0,70,1],[95,0,95,7],[115,1,116,1],[61,0,61,1],[64,0,64,1],[66,0,66,1],[168,2,168,4],[163,2,163,4],[163,1,164,1],[168,0,169,0],[163,0,164,0],[161,0,161,7],[143,0,144,0],[143,2,143,4],[143,5,150,7],[145,2,145,4],[148,2,148,4],[154,2,154,4],[157,2,157,4],[152,0,153,0],[152,2,152,4],[152,5,159,7],[143,1,144,1],[152,1,153,1],[0,0,0,7],[2,0,2,7],[3,0,4,3],[3,6,4,7],[30,0,30,7],[7,2,7,4],[8,2,19,7],[23,2,28,7],[32,0,43,0],[32,2,43,7],[60,0,60,7],[45,0,45,7],[47,2,52,7],[48,0,52,0],[53,2,58,7],[54,0,58,0]]}
["EC DATA (DETAILED BUDGET TABLE AG — PROPOSAL/GRANT PREPARATION)"]
[]
["Work package numbers"]
[null,null,null,null,"WP_nb","PW"]
[null,null,null,null,6,"Detailed budget table"]
[]
["Which cost categories?"]
[null,"1=Yes / 0=No","Index and WP"]
["A. Personnel costs",1,0]
["B. Subcontracting costs",1]
["C1. Travel and subsistence",1]
["C2. Equipment",1]
["C3. Other goods, works and services ",1]
["D.1. Financial support to third parties",0]
["D.2 [Category name]",0]
{"$rows_left_out":158}
{"sheet":"EC Format","index":2,"n_rows":178,"n_cols":23,"rows_kept":178,"cut":false,"hidden":false,"merged":[[166,0,166,1],[168,1,169,1],[168,2,169,2],[168,7,169,7],[168,8,169,8],[172,1,173,1],[172,3,172,5],[172,7,173,7],[172,8,173,8],[128,1,129,1],[128,2,129,2],[152,7,153,7],[152,8,153,8],[142,3,142,5],[136,0,136,1],[138,1,139,1],[138,2,139,2],[138,7,139,7],[138,8,139,8],[132,1,133,1],[132,7,133,7],[132,8,133,8],[132,3,132,5],[128,7,129,7],[128,8,129,8],[156,0,156,1],[162,1,163,1],[162,7,163,7],[162,8,163,8],[158,1,159,1],[158,2,159,2],[158,7,159,7],[158,8,159,8],[101,6,103,6],[101,7,103,7],[101,8,103,8],[148,2,149,2],[102,3,103,3],[101,3,101,5],[148,7,149,7],[148,8,149,8],[121,6,121,8],[126,0,126,1],[115,1,115,4],[116,3,116,5],[116,6,118,6],[142,1,143,1],[142,7,143,7],[142,8,143,8],[121,3,121,4],[124,3,124,4],[106,6,106,8],[107,3,107,5],[107,6,109,6],[107,7,109,7],[107,8,109,8],[108,3,109,3],[108,4,109,4],[108,5,109,5],[115,6,115,8],[112,6,112,8],[113,2,113,8],[117,3,118,3],[117,4,118,4],[117,5,118,5],[116,7,118,7],[85,3,86,6],[75,8,77,8],[75,2,75,6],[80,3,80,5],[77,3,77,4],[76,3,76,4],[66,2,68,2],[65,8,69,8],[65,7,69,7],[66,3,68,3],[66,4,68,4],[75,7,77,7],[85,8,86,8],[85,7,86,7],[65,2,65,6],[64,2,64,8],[57,6,57,8],[58,6,58,8],[59,6,59,8],[61,6,61,8],[65,1,69,1],[66,6,68,6],[72,3,72,5],[66,5,68,5],[50,6,51,6],[54,6,55,6],[45,6,45,8],[49,6,49,8],[53,6,53,8],[46,6,47,6],[42,0,42,8],[25,1,25,8],[27,1,27,4],[27,6,27,8],[0,0,0,8],[36,0,36,8],[30,0,30,8],[15,1,15,4],[16,1,16,8],[19,1,19,8],[28,6,28,8],[21,6,21,8],[18,6,18,8],[15,6,15,8],[8,6,8,8],[5,1,5,8],[32,3,32,6],[2,1,2,3],[9,1,9,5],[8,1,8,4],[12,1,12,8],[21,1,21,4],[18,1,18,4],[28,1,28,4],[22,1,22,8],[24,1,24,4],[24,6,24,8],[34,3,34,8],[176,0,176,8],[73,1,73,5],[75,1,77,1],[82,1,82,5],[81,1,81,5],[85,0,86,1],[78,3,78,4],[79,3,79,4],[97,0,97,1],[74,2,74,8],[97,3,97,8],[85,2,86,2],[124,6,124,8],[98,0,98,8],[110,2,110,8],[112,1,112,4],[146,0,146,1],[152,1,153,1],[152,3,152,5],[148,1,149,1],[116,8,118,8],[102,4,103,4],[102,5,103,5],[162,3,162,5]]}
["A. Personnel costs ",null,null,null,null,null,null,null,null,"Row to add/delete\n& Height row","Number to 0","Text to blank","Row to hide"]
["WORK PACKAGE 1 ",null,null,null,null,null,null,null,null,"F-18"]
[null,"A.1 Employees (or equivalent)",null,null,null,null,null,null,null,"F-18",null,null,"Shown"]
[null,"Select a staff category","monthly",0,0,{"$f":"E4*D4","v":0},null,null,null,"Last","4#5","8#9","Shown"]
[null,"Select a staff category","monthly",0,0,{"$f":"E5*D5","v":0},null,null,null,"Authorised","4#5","8#9","Shown"]
[null,"Other ",null,null,null,null,null,null,null,"F-18",null,null,"Shown"]
[null,"[category 1]","monthly",0,0,{"$f":"E7*D7","v":0},null,null,null,"Last","4#5","8#9","Shown"]
[null,"[category 2]","monthly",0,0,{"$f":"E8*D8","v":0},null,null,null,"Authorised","4#5","8#9","Shown"]
[null,"Total employees (or equivalent)",null,null,null,{"$f":"SUM(F3:F8)","v":0},null,null,null,"F-18",null,null,"Shown"]
[null,"A.2 + A.3 Natural persons under direct contract and seconded persons ",null,null,null,null,null,null,null,"F-18",null,null,"Shown"]
[null,"Select a staff category","monthly",0,0,{"$f":"D11*E11","v":0},null,null,null,"Last","4#5","8#9","Shown"]
[null,"Select a staff category","monthly",0,0,{"$f":"D12*E12","v":0},null,null,null,"Authorised","4#5","8#9","Shown"]
[null,"Other ",null,null,null,null,null,null,null,"F-18",null,null,"Shown"]
[null,"[category 1]","monthly",0,0,{"$f":"D14*E14","v":0},null,null,null,"Last","4#5","8#9","Shown"]
[null,"[category 2]","monthly",0,0,{"$f":"D15*E15","v":0},null,null,null,"Authorised","4#5","8#9","Shown"]
{"$rows_left_out":164}
{"sheet":"1. Instructions","index":3,"n_rows":54,"n_cols":1,"rows_kept":54,"cut":false,"hidden":false,"merged":[]}
["INSTRUCTIONS (DETAILED BUDGET TABLE ACTION GRANTS — PROPOSAL/GRANT PREPARATION)"]
[]
["General"]
["The file is composed of 5 sheets (Instructions, Start, Detailed table, Consolidated table (participants) and Consolidated table (project)) which must be used to create your detailed budget table."]
["Depending on the instructions in the call document, you should submit the budget table either as part of your proposal and/or during grant preparation: \n- for proposal: merge, scan and attach it as a single PDF to your Application Form Part B (Funding & Tenders Portal Submission System; only sheets 3, 4, and 5 needed; for sheets 3 and 4: one per beneficiary/affiliated entity; more details on technical instructions are in the Online Manual) \n- for grant preparation (if needed, after changes requested by the EU): merge, scan and attach it as a single PDF to your Desription of the Action (DoA) Part B (Funding & Tenders Portal Grant Preparation tool).\n\nATTENTION! You may be asked to provide an Excel file by email during evaluation and grant preparation, if needed."]
["The budget table is broken down by cost category and work packages. For technical reasons the number of work packages has to be the same in all categories. Please leave them empty, if there are no costs. "]
[]
[]
[]
[]
[]
[]
[]
[]
["The budgeted amounts should be based on detailed, reasonable and accurate estimates. Keep sufficient documentation to be able to explain them if requested."]
{"$rows_left_out":40}
{"sheet":"2. Start","index":4,"n_rows":22,"n_cols":6,"rows_kept":22,"cut":false,"hidden":false,"merged":[[11,0,14,4],[1,0,1,3],[0,0,0,4],[3,0,3,1],[4,0,4,1],[5,0,5,1],[3,3,6,4],[2,0,2,4],[10,0,10,4],[6,0,6,1]]}
["START (DETAILED BUDGET TABLE — PROPOSAL/GRANT PREPARATION)"]
[]
["PROJECT DATA"]
["Project number:",null,210747735]
["Project acronym:",null,"FORMATEX23"]
["Participant short name:"]
["Participant PIC:"]
[]
[]
[]
["WORK PACKAGES & TRAVELS"]
[]
[]
[]
[]
{"$rows_left_out":8}
{"sheet":"3. Detailed table ","index":5,"n_rows":648,"n_cols":13,"rows_kept":648,"cut":false,"hidden":false,"merged":[[555,0,556,1],[555,2,556,2],[555,3,556,6],[555,7,556,7],[555,8,556,8],[567,0,567,1],[567,3,567,8],[473,7,475,7],[473,8,475,8],[474,3,474,4],[475,3,475,4],[476,3,476,4],[477,3,477,4],[478,3,478,5],[479,1,479,5],[480,1,480,5],[541,8,542,8],[553,0,553,1],[553,3,553,8],[527,0,528,1],[527,2,528,2],[527,3,528,6],[527,7,528,7],[527,8,528,8],[161,1,161,3],[164,1,164,8],[167,1,167,4],[167,6,167,8],[168,1,168,5],[171,1,171,8],[174,1,174,4],[174,6,174,8],[175,1,175,8],[177,1,177,4],[177,6,177,8],[178,1,178,8],[180,1,180,4],[180,6,180,8],[181,1,181,8],[183,1,183,4],[183,6,183,8],[184,1,184,8],[541,7,542,7],[462,2,462,8],[463,1,467,1],[463,2,463,6],[463,7,467,7],[463,8,467,8],[464,2,466,2],[464,3,466,3],[464,4,466,4],[464,5,466,5],[464,6,466,6],[470,3,470,5],[471,1,471,5],[539,0,539,1],[539,3,539,8],[525,0,525,1],[525,3,525,8],[513,8,514,8],[187,1,187,4],[456,3,456,4],[457,3,457,4],[458,3,458,5],[459,1,459,5],[460,1,460,5],[541,0,542,1],[541,2,542,2],[541,3,542,6],[472,2,472,8],[473,1,475,1],[473,2,473,6],[450,3,450,5],[451,1,451,5],[452,2,452,8],[453,1,455,1],[453,2,453,6],[453,7,455,7],[453,8,455,8],[454,3,454,4],[455,3,455,4],[443,7,447,7],[443,8,447,8],[444,2,446,2],[444,3,446,3],[444,4,446,4],[444,5,446,5],[444,6,446,6],[335,6,335,8],[336,6,337,6],[339,6,339,8],[340,6,341,6],[343,6,343,8],[344,6,345,6],[347,6,347,8],[348,6,348,8],[349,6,349,8],[436,3,436,4],[437,3,437,4],[438,3,438,5],[439,1,439,5],[419,1,419,5],[420,1,420,5],[410,3,410,5],[411,1,411,5],[412,2,412,8],[413,1,415,1],[413,2,413,6],[133,1,133,3],[136,1,136,8],[139,1,139,4],[139,6,139,8],[140,1,140,5],[143,1,143,8],[146,1,146,4],[146,6,146,8],[147,1,147,8],[149,1,149,4],[149,6,149,8],[150,1,150,8],[152,1,152,4],[152,6,152,8],[153,1,153,8],[155,1,155,4],[155,6,155,8],[433,7,435,7],[433,8,435,8],[434,3,434,4],[435,3,435,4],[322,6,323,6],[325,6,325,8],[326,6,326,8],[327,6,327,8],[402,2,402,8],[403,1,407,1],[403,2,403,6],[403,7,407,7],[403,8,407,8],[416,3,416,4],[417,3,417,4],[418,3,418,5],[105,1,105,3],[108,1,108,8],[111,1,111,4],[111,6,111,8],[112,1,112,5],[115,1,115,8],[118,1,118,4],[118,6,118,8],[119,1,119,8],[121,1,121,4],[121,6,121,8],[122,1,122,8],[124,1,124,4],[124,6,124,8],[125,1,125,8],[127,1,127,4],[127,6,127,8],[321,6,321,8],[283,6,283,8],[221,0,222,1],[226,6,227,6],[229,6,229,8],[230,6,231,6],[233,6,233,8],[234,6,235,6],[237,6,237,8],[251,6,251,8],[252,6,253,6],[255,6,255,8],[256,6,257,6],[259,6,259,8],[260,6,260,8],[261,6,261,8],[413,7,415,7],[413,8,415,8],[414,3,414,4],[415,3,415,4],[513,0,514,1],[513,2,514,2],[513,3,514,6],[513,7,514,7],[422,2,422,8],[423,1,427,1],[423,2,423,6],[423,7,427,7],[423,8,427,8],[424,2,426,2],[424,3,426,3],[424,4,426,4],[424,5,426,5],[424,6,426,6],[430,3,430,5],[431,1,431,5],[432,2,432,8],[433,1,435,1],[433,2,433,6],[440,1,440,5],[442,2,442,8],[443,1,447,1],[443,2,443,6],[404,2,406,2],[404,3,406,3],[404,4,406,4],[404,5,406,5],[404,6,406,6],[291,6,291,8],[292,6,293,6],[295,6,295,8],[296,6,297,6],[299,6,299,8],[300,6,301,6],[303,6,303,8],[304,6,304,8],[305,6,305,8],[313,6,313,8],[314,6,315,6],[317,6,317,8],[318,6,319,6],[359,1,359,4],[373,7,375,7],[373,8,375,8],[362,2,362,8],[204,3,204,8],[269,6,269,8],[270,6,271,6],[273,6,273,8],[274,6,275,6],[277,6,277,8],[278,6,279,6],[281,6,281,8],[282,6,282,8],[206,3,206,6],[208,3,208,8],[210,3,210,6],[212,3,212,8],[214,3,214,6],[216,3,216,8],[221,3,221,5],[221,7,222,7],[356,3,356,4],[357,3,357,4],[358,3,358,4],[355,6,355,8],[247,6,247,8],[248,6,249,6],[97,1,97,8],[99,1,99,4],[99,6,99,8],[100,1,100,8],[102,1,102,4],[102,6,102,8],[103,1,103,4],[103,6,103,8],[202,3,202,6],[131,6,131,8],[156,1,156,8],[158,1,158,4],[158,6,158,8],[159,1,159,4],[159,6,159,8],[187,6,187,8],[194,3,194,6],[196,3,196,8],[128,1,128,8],[130,1,130,4],[130,6,130,8],[131,1,131,4],[186,1,186,4],[186,6,186,8],[87,1,87,8],[90,1,90,4],[90,6,90,8],[91,1,91,8],[93,1,93,4],[93,6,93,8],[94,1,94,8],[96,1,96,4],[96,6,96,8],[586,1,586,4],[582,1,582,4],[572,2,572,3],[578,1,578,4],[573,2,573,4],[481,7,481,8],[569,3,569,8],[482,0,482,5],[568,0,568,8],[482,7,482,8],[485,0,486,1],[485,2,486,2],[485,3,486,6],[485,7,486,7],[485,8,486,8],[497,0,497,1],[497,3,497,8],[499,0,500,1],[499,2,500,2],[499,3,500,6],[499,7,500,7],[499,8,500,8],[511,0,511,1],[511,3,511,8],[614,0,614,8],[590,1,590,4],[607,7,608,7],[611,4,611,6],[607,8,608,8],[594,1,594,4],[598,1,598,4],[599,1,599,4],[602,0,604,0],[607,2,607,4],[610,2,610,3],[600,0,600,1],[644,3,644,8],[616,3,616,8],[644,0,644,1],[616,0,616,1],[628,3,628,8],[618,3,618,4],[629,3,629,8],[629,0,629,1],[627,3,627,7],[626,0,626,1],[632,0,632,1],[638,0,638,1],[619,1,619,4],[17,6,19,6],[16,0,16,1],[17,8,19,8],[191,7,192,7],[17,0,19,1],[18,2,19,2],[190,0,190,1],[191,8,192,8],[191,3,192,6],[27,6,27,8],[28,1,28,5],[31,1,31,8],[34,1,34,4],[34,6,34,8],[35,1,35,8],[46,6,46,8],[37,1,37,4],[37,6,37,8],[38,1,38,8],[40,1,40,4],[40,6,40,8],[47,1,47,4],[47,6,47,8],[66,1,66,8],[238,6,238,8],[239,6,239,8],[225,6,225,8],[14,0,14,8],[16,2,16,8],[189,0,189,4],[0,0,0,8],[2,0,2,8],[4,4,4,5],[4,6,4,7],[12,0,12,8],[6,7,6,8],[6,4,6,6],[11,0,11,8],[9,0,9,8],[10,0,10,8],[21,1,21,3],[24,1,24,8],[27,1,27,4],[17,7,19,7],[15,0,15,8],[17,2,17,5],[41,1,41,8],[43,1,43,4],[43,6,43,8],[44,1,44,8],[46,1,46,4],[65,1,65,4],[65,6,65,8],[221,6,222,6],[221,8,222,8],[218,1,218,4],[191,2,192,2],[191,0,192,1],[72,1,72,8],[74,1,74,4],[74,6,74,8],[75,1,75,4],[75,6,75,8],[68,1,68,4],[68,6,68,8],[69,1,69,8],[71,1,71,4],[71,6,71,8],[198,3,198,6],[200,3,200,8],[77,1,77,3],[80,1,80,8],[83,1,83,4],[83,6,83,8],[84,1,84,5],[49,1,49,3],[52,1,52,8],[55,1,55,4],[55,6,55,8],[56,1,56,5],[59,1,59,8],[62,1,62,4],[62,6,62,8],[63,1,63,8],[363,1,367,1],[363,2,363,6],[363,7,367,7],[363,8,367,8],[364,2,366,2],[364,3,366,3],[364,4,366,4],[364,5,366,5],[364,6,366,6],[382,2,382,8],[383,1,387,1],[383,2,383,6],[383,7,387,7],[383,8,387,8],[384,2,386,2],[384,3,386,3],[384,4,386,4],[384,5,386,5],[384,6,386,6],[376,3,376,4],[377,3,377,4],[378,3,378,5],[379,1,379,5],[380,1,380,5],[370,3,370,5],[371,1,371,5],[372,2,372,8],[373,1,375,1],[373,2,373,6],[374,3,374,4],[375,3,375,4],[399,1,399,5],[400,1,400,5],[390,3,390,5],[391,1,391,5],[392,2,392,8],[393,1,395,1],[393,2,393,6],[393,7,395,7],[393,8,395,8],[394,3,394,4],[395,3,395,4],[396,3,396,4],[397,3,397,4],[398,3,398,5]]}
["a",null,null,null,null,null,null,null,null,"Row to add/delete\n& Height row","Number to 0","Text to blank","Row to hide"]
[]
["EU GRANTS DETAILED BUDGET TABLE (ACTION GRANTS)",null,null,null,null,null,null,null,null,"F-28"]
[]
["Project number:",{"$f":"IF(ISBLANK('2. Start'!C4),\" \",'2. Start'!C4)","v":210747735},null,null,null,null,null,null,"2021-06-02T12:35:13","F-18"]
["Project acronym:",{"$f":"IF(ISBLANK('2. Start'!C5),\" \",'2. Start'!C5)","v":"FORMATEX23"},null,null,null,null,null,null,null,"F-18"]
["Participant short name:",{"$f":"IF(ISBLANK('2. Start'!C6),\" \",'2. Start'!C6)","v":" "},null,null,null,null,null,null,null,"F-18"]
["Participant PIC:",{"$f":"IF(ISBLANK('2. Start'!C7),\" \",'2. Start'!C7)","v":" "},null,null,null,null,null,null,null,"F-18"]
[]
["ATTENTION: This  table should be  filled out one per participant (beneficiary, affiliated entity)",null,null,null,null,null,null,null,null,"F-18"]
["ATTENTION: This  table may  ONLY contain eligible costs (i.e. costs that comply with the eligibility rules of the grant agreement that is part of your call documents). At proposal stage and during grant preparation, it should contain estimated costs/income. Costs must be estimated in EUR.",null,null,null,null,null,null,null,null,"F-18"]
["ATTENTION! List each budgeted cost item ONLY once in this table, for the main WP.",null,null,null,null,null,null,null,null,"F-18"]
["ATTENTION! White cells mean that you are required to enter data. Blue cells are calculated automatically.",null,null,null,null,null,null,null,null,"F-18"]
[]
["EU PROJECT BUDGET TABLE (PER PARTICIPANT)",null,null,null,null,null,null,null,null,"F-28"]
{"$rows_left_out":634}
{"sheet":"4. Consolid table (participant)","index":6,"n_rows":25,"n_cols":23,"rows_kept":25,"cut":false,"hidden":false,"merged":[[7,0,7,20],[8,0,8,20],[9,20,10,20],[9,7,9,12],[9,0,10,0],[9,1,10,1],[9,2,10,2],[9,3,10,3],[9,19,10,19],[9,4,10,4],[9,6,10,6],[9,13,9,18],[9,5,10,5],[2,1,2,2],[3,1,3,2],[4,1,4,2],[5,1,5,2],[0,0,0,20],[1,0,1,3]]}
["EU GRANTS DETAILED BUDGET TABLE (ACTION GRANTS)"]
[]
["Project number:",{"$f":"IF(ISBLANK('2. Start'!C4),\" \",'2. Start'!C4)","v":210747735}]
["Project acronym:",{"$f":"IF(ISBLANK('2. Start'!C5),\" \",'2. Start'!C5)","v":"FORMATEX23"}]
["Participant short name:",{"$f":"IF(ISBLANK('2. Start'!C6),\" \",'2. Start'!C6)","v":" "}]
["Participant PIC:",{"$f":"IF(ISBLANK('2. Start'!C7),\" \",'2. Start'!C7)","v":" "}]
[]
["CONSOLIDATED COSTS PER WORK PACKAGE (PER PARTICIPANT)"]
["COSTS PER WORK PACKAGE"]
[null,"A.1 Employees\nA.2 + A.3 Natural persons under direct contract and seconded persons\n","A.4 SME owners","A.5 Volunteers ",{"$f":"'EC Data'!A28","v":"A.6 [Category name]"},{"$f":"'EC Data'!A29","v":"A.7 [Category name]"},"B. Subcontracting costs","C. Purchase costs",null,null,null,null,null,"D. Other cost categories",null,null,null,null,null,"E. Indirect costs\n","Total"]
[null,null,null,null,null,null,null,"C.1 Travel and subsistence","C.1 Travel","C.1 Accomodation","C.1 Subsistence","C.2 Equipment","C.3 Other goods, work and services","D.1 Financial support to third parties",{"$f":"'EC Data'!A15","v":"D.2 [Category name]"},{"$f":"'EC Data'!A16","v":"D.3 [Category name]"},{"$f":"'EC Data'!A17","v":"D.4 [Category name]"},{"$f":"'EC Data'!A18","v":"D.5 [Category name]"},{"$f":"'EC Data'!A19","v":"D.6 [Category name]"}]
[null,"a1 - a2","a3","a4","a5","a6","b","c1","c1a","c1b","c1c","c2","c3","d1","d2","d3","d4","d5","d6","e = flat-rate * (a1 + a2 + a3 + a5 + b [+ c1] + [c1a + c1b + c1c] + c2 + c3  + d1 + d2 + d3 + d4 + d5 + d6)"]
[null,null,null,null,null,null,null,null,null,null,null,null,null,"(N/A)"]
[null,null,null,null,null,null,null,null,null,null,null,null,null,null,null,null,null,null,null,null,null,null,"Hidden"]
[{"$f":"\"WP1 \" & IDX_WP_Name_1","v":"WP1 PROJECT MANAGEMENT"},{"$f":"WP_A1_1_subTotal+WP_A1_2_subTotal","v":17400},{"$f":"WP_A1_3_subTotal","v":0},{"$f":"WP_A1_4_subTotal","v":0},{"$f":"WP_A1_5_subTotal","v":0},{"$f":"WP_A1_6_subTotal","v":0},{"$f":"WP_C1_Total","v":0},{"$f":"WP_B1_1_subTotal+WP_B1_2_subTotal+WP_B1_3_subTotal","v":1900},{"$f":"WP_B1_1_subTotal","v":1100},{"$f":"WP_B1_2_subTotal","v":500},{"$f":"WP_B1_3_subTotal","v":300},{"$f":"WP_E11_Total","v":0},{"$f":"WP_E21_Total","v":0},"N/A","N/A","N/A","N/A","N/A","N/A",null,{"$f":"WP_A1_1_subTotal+WP_A1_2_subTotal+WP_A1_3_subTotal+WP_A1_4_subTotal+WP_A1_5_subTotal+WP_A1_6_subTotal+WP_C1_Total+WP_B1_1_subTotal+WP_B1_2_subTotal+WP_B1_3_subTotal+WP_E11_Total+WP_E21_Total","v":19300},null,"Shown"]
{"$rows_left_out":11}
{"sheet":"5. Consolid table (project)","index":7,"n_rows":21,"n_cols":21,"rows_kept":21,"cut":false,"hidden":false,"merged":[[18,0,18,20],[7,0,7,20],[8,0,8,20],[9,1,10,1],[9,2,10,2],[9,3,10,3],[9,4,10,4],[12,0,12,20],[0,0,0,20],[1,0,1,3],[2,1,2,2],[3,1,3,2],[15,0,15,20],[5,0,5,20],[9,5,10,5],[9,6,10,6],[9,7,9,12],[9,13,9,18],[9,19,10,19],[9,0,11,0],[9,20,11,20]]}
["EU GRANTS DETAILED BUDGET TABLE (ACTION GRANTS)"]
[]
["Project number:",{"$f":"IF(ISBLANK('2. Start'!C4),\" \",'2. Start'!C4)","v":210747735}]
["Project acronym:",{"$f":"IF(ISBLANK('2. Start'!C5),\" \",'2. Start'!C5)","v":"FORMATEX23"}]
[]
["ATTENTION! Delete columns that do not apply for your grant. "]
[]
["CONSOLIDATED COSTS PER WORK PACKAGE (PROJECT)"]
["PROJECT COSTS PER WORK PACKAGE"]
[null,"A.1 Employees\nA.2 + A.3 Natural persons under direct contract and seconded persons","A.4 SME owners","A.5 Volunteers ",{"$f":"'EC Data'!A28","v":"A.6 [Category name]"},{"$f":"'EC Data'!A29","v":"A.7 [Category name]"},"B. Subcontracting costs","C. Purchase costs",null,null,null,null,null,"D. Other cost categories",null,null,null,null,null,"E. Indirect costs\n","Total"]
[null,null,null,null,null,null,null,"C.1 Travel and subsistence","C.1 Travel","C.1 Accomodation","C.1 Subsistence","C.2 Equipment","C.3 Other goods, works and services","D.1 Financial support to third parties",{"$f":"'EC Data'!A15","v":"D.2 [Category name]"},{"$f":"'EC Data'!A16","v":"D.3 [Category name]"},{"$f":"'EC Data'!A17","v":"D.4 [Category name]"},{"$f":"'EC Data'!A18","v":"D.5 [Category name]"},{"$f":"'EC Data'!A19","v":"D.6 [Category name]"}]
[null,"a1 - a2","a3","a4","a5","a6","b","c1","c1a","c1b","c1c","c2","c3","d1","d2","d3","d4","d5","d6","e = flat-rate * (a1 + a2 + a3 + a5 + b [+ c1] + [c1a + c1b + c1c] + c2 + c3  + d1 + d2 + d3 + d4 + d5 + d6)"]
["PARTICIPANT [name]"]
["TOTAL COSTS PARTICIPANT (Proposal Step)",null,null,null,null,null,null,null,null,null,null,null,null,null,null,null,null,null,null,null,{"$f":"SUM(B14:T14)","v":0}]
["TOTAL COSTS PARTICIPANT (Grant Preparation Step)",null,null,null,null,null,null,null,null,null,null,null,null,null,null,null,null,null,null,null,{"$f":"SUM(B15:T15)","v":0}]
{"$rows_left_out":6}